随笔 - 632  文章 - 17  评论 - 54  阅读 - 92万

Mac下OpenCV4.5.5+opencv_contrib4.5.5+CMake编译

一、概述

  背景:19年mac机上安装过opencv,昨天清理电脑磁盘(把不要的删除掉),结果把opencv误删除掉了。所以决定重新编译一份。

      过程中遇到了不少问题,这里做个记录,以便下次遇到的时候查阅,当然也方便其他开发同学。

二、操作步骤

  1.去opencv官网下载下载:opencv源代码和opencv_contrib

  2.下载cmake,直接下载.dmp文件安装即可

  3.打开cmake的gui界面,并选择对应的路径,如下

  

 

  4.选择配置opencv_contrib扩展模块,如下图

  

 

 

  5.执行make -j4

  6.执行sudo make install进行安装

 

三、遇到的问题

  1.下载ippicv困难和face_landmark_model.dat苦难

  解决办法:

    a.手动下载ippicv_2020_mac_intel64_20191018_general.tgz到Downloads(可以是任意目录,此处演示用Downloads目录)

    b.找到opencv4.4.5源码下的3rdparty目录下的ippicv目录下的ippicv.cmake并打开

  

 

  c.修改ippicv.cmake中的下载路径为你下载文件的路径

  

 

 

 

  2.编译时遇到的异常,如下:

复制代码
[ 58%] Linking CXX shared library ../../lib/libopencv_imgcodecs.dylib
Undefined symbols for architecture x86_64:
  "_jpeg_default_qtables", referenced from:
      cv::JpegEncoder::write(cv::Mat const&, std::__1::vector<int, std::__1::allocator<int> > const&) in grfmt_jpeg.cpp.o
ld: symbol(s) not found for architecture x86_64
clang: error: linker command failed with exit code 1 (use -v to see invocation)
make[2]: *** [lib/libopencv_imgcodecs.4.1.1.dylib] Error 1
make[1]: *** [modules/imgcodecs/CMakeFiles/opencv_imgcodecs.dir/all] Error 2
make[1]: *** Waiting for unfinished jobs....
复制代码

  解决办法:

    在源码中找到/Users/xxx/opencv-4.2.0/3rdparty/libjpeg-turbo 目录并打开,打开CMakeLists.txt打开找到如下图所示:

    

 

    参考:https://github.com/opencv/opencv/issues/18541

 

三、总结

  这一次配置环境搞的时间有点久,从昨天早上到今天上午才搞定。主要的坑在于config时下载文件的速度过慢,还有版本问题。特别是版本问题如果是最新的系统,最好选用opencv最新版本。我反反复复的尝试好好多个版本,从4.0.0、4.1.1、4.1.2、4.5.2、4.5.5,其中有各种各样的问题,最后编译好的是4.5.5(我把系统升级到了最新版)  

posted on   飘杨......  阅读(917)  评论(0编辑  收藏  举报
相关博文:
阅读排行:
· CSnakes vs Python.NET:高效嵌入与灵活互通的跨语言方案对比
· DeepSeek “源神”启动!「GitHub 热点速览」
· 我与微信审核的“相爱相杀”看个人小程序副业
· 上周热点回顾(2.17-2.23)
· 如何使用 Uni-app 实现视频聊天(源码,支持安卓、iOS)
< 2025年2月 >
26 27 28 29 30 31 1
2 3 4 5 6 7 8
9 10 11 12 13 14 15
16 17 18 19 20 21 22
23 24 25 26 27 28 1
2 3 4 5 6 7 8

点击右上角即可分享
微信分享提示